{"text_format":"1","workbook":"xlsx","n_sheets":4,"sheets":["Baugruppe seitlich mit SDE","Baugruppe seitlich","Baugruppe oben unten","Gerät mit Abluft-VT"],"not_rendered":{"charts":0,"images":0,"macros":1,"external_links":0,"defined_names":0,"comments":0,"pivot_tables":0},"unopened":[],"bounds":{"document_bytes":16777216,"sheet_cells":100000,"rows_first":2000,"rows_last":500,"rows_between":2000,"halvings":0,"cell_chars":16384,"cell_head_chars":4096},"cells_cut":0,"cells_raw":0,"read":"whole","date_system":"1900"}

{"sheet":"Baugruppe seitlich mit SDE","index":0,"n_rows":44,"n_cols":21,"rows_kept":44,"cut":false,"hidden":false,"merged":[[25,3,25,6],[26,3,26,6],[27,3,27,6],[28,3,28,6],[20,1,20,2],[20,3,20,6],[21,3,21,6],[22,3,22,6],[23,3,23,6],[24,3,24,6],[34,3,34,6],[35,3,35,6],[36,3,36,6],[37,3,37,6],[38,3,38,6],[29,3,29,6],[30,3,30,6],[31,3,31,6],[32,3,32,6],[33,3,33,6],[40,3,40,6],[41,3,41,6],[42,3,42,6],[43,3,43,6],[39,3,39,6]]}
["PROJEKT: "]
[]
["Wandstärke:",25]
[]
[]
["Wohnung","Typ","ZUL","Ablufträume","ANZ Whg","SN100","Summe","ZUL TV100","Summe","ABL TV100","Summe","SN125","Summe","ZUL TV125","Summe","ABL TV125","Summe","Abg.","m/Abg.","Gesamt/Whg","Summe"]
[null,"2-Zimmer","links","Bad, Küche",null,0,{"$f":"F7*E7","v":0},0,{"$f":"H7*E7","v":0},0,{"$f":"J7*E7","v":0},3,{"$f":"L7*E7","v":0},1,{"$f":"N7*E7","v":0},2,{"$f":"P7*E7","v":0},6,8,{"$f":"R7*S7","v":48},{"$f":"T7*E7","v":0}]
[null,"2-Zimmer","rechts","Bad, Küche",null,0,0,0,0,0,0,3,0,1,0,2,0,6,8,48,0]
[null,"2-Zimmer","links","WC, Bad, Küche",null,1,0,0,0,1,0,3,0,1,0,2,0,7,8,56,0]
[null,"2-Zimmer","rechts","WC, Bad, Küche",null,1,0,0,0,1,0,3,0,1,0,2,0,7,8,56,0]
[null,"2-Zimmer","links","WC, Bad, Küche, AR",null,2,0,0,0,2,0,3,0,1,0,2,0,8,8,64,0]
[null,"2-Zimmer","rechts","WC, Bad, Küche, AR",null,2,0,0,0,2,0,3,0,1,0,2,0,8,8,64,0]
[null,"3-Zimmer","links","WC, Bad, Küche",null,2,0,1,0,1,0,3,0,1,0,2,0,8,8,64,0]
[null,"3-Zimmer","rechts","WC, Bad, Küche",null,2,0,1,0,1,0,3,0,1,0,2,0,8,8,64,0]
[null,"3-Zimmer","links","WC, Bad, Küche, AR",null,3,0,1,0,2,0,3,0,1,0,2,0,9,8,72,0]
[null,"3-Zimmer","rechts","WC, Bad, Küche, AR",null,3,0,1,0,2,0,3,0,1,0,2,0,9,8,72,0]
[null,"4-Zimmer","links","WC, Bad, Küche, AR",null,4,0,2,0,2,0,3,0,1,0,2,0,10,8,80,0]
[null,"4-Zimmer","rechts","WC, Bad, Küche, AR",null,4,0,2,0,2,0,3,0,1,0,2,0,10,8,80,0]
[null,null,null,null,{"$f":"SUM(E7:E18)","v":0},null,{"$f":"SUM(G7:G18)","v":0},null,{"$f":"SUM(I7:I18)","v":0},null,{"$f":"SUM(K7:K18)","v":0},null,{"$f":"SUM(M7:M18)","v":0},null,{"$f":"SUM(O7:O18)","v":0},null,{"$f":"SUM(Q7:Q18)","v":0},null,null,null,{"$f":"SUM(U7:U18)","v":0}]
[]
["Stück","Art.-Nr.",null,"Artikel"]
[{"$f":"E19*2","v":0},{"$f":"IF(B3=30,\"KLLAIRVT30\",\"KLLAIRVT25\")","v":"KLLAIRVT25"},null,{"$f":"IF(B22=\"KLLAIRVT30\",\"Verteilerelement 30cm\",\"Verteilerelement 25cm\")","v":"Verteilerelement 25cm"}]
[{"$f":"E8+E10+E12+E14+E16+E18","v":0},{"$f":"IF(B3=30,\"KLLAIRBGOR30SDE\",\"KLLAIRBGOR25SDE\")","v":"KLLAIRBGOR25SDE"},null,{"$f":"IF(B23=\"KLLAIRBGOR30SDE\",\"Baugruppe mit SDE rechts 30cm\",\"Baugruppe mit SDE rechts 25cm\")","v":"Baugruppe mit SDE rechts 25cm"}]
[{"$f":"E7+E9+E11+E13+E15+E17","v":0},{"$f":"IF(B3=30,\"KLLAIRBGOL30SDE\",\"KLLAIRBGOL25SDE\")","v":"KLLAIRBGOL25SDE"},null,{"$f":"IF(B24=\"KLLAIRBGOL30SDE\",\"Baugruppe mit SDE links 30cm\",\"Baugruppe mit SDE links 25cm\")","v":"Baugruppe mit SDE links 25cm"}]
[{"$f":"E19*2","v":0},"KLLKUNI100",null,"Doppelnippel DN100"]
[{"$f":"ROUNDUP(E19*5.1/25,0)","v":0},"KLLAIRSF20",null,"Bauteilfugenabdichtungsband innen"]
[{"$f":"ROUNDUP(E19*5.1/25,0)","v":0},"KLLAIRSF2",null,"Bauteilfugenabdichtungsband aussen"]
[{"$f":"E19","v":0},"KLLAIRZUU",null,"Zuluftumschaltung"]
[{"$f":"E19","v":0},"KLLAIRIBV",null,"Designinnenblende"]
[{"$f":"E19","v":0},"KLLAIRFLAAF",null,"Fassadenanschluss AUL/FOL"]
[{"$f":"E19","v":0},{"$f":"IF(#REF!=16,\"KLLAIRFLEB16\",IF(#REF!=18,\"KLLAIRFLEB18\",IF(#REF!=20,\"KLLAIRFLEB20\")))","v":{"$error":"#REF!"}},null,{"$f":"IF(B31=\"KLLAIRFLEB16\",\"Fensterlaibungselement 16cm\",IF(B31=\"KLLAIRFLEB18\",\"Fensterlaibungselement 18cm\",IF(B31=\"KLLAIRFLEB20\",\"Fensterlaibungselement 20cm\")))","v":{"$error":"#REF!"}}]
[{"$f":"E19*2","v":0},"KLLAIRFAG",null,"Aussenwandgitter"]
[{"$f":"E19","v":0},"HOIBNKLAIRW1",null,"Inbetriebnahme"]
[{"$f":"G19","v":0},"KLLZSN10075",null,"Saugnische 100"]
[{"$f":"M19","v":0},"KLLZSN125752",null,"Saugnische 125"]
[{"$f":"G19","v":0},"KLLZSNFL100",null,"Flansch 100"]
[{"$f":"M19","v":0},"KLLZSNFL125",null,"Flansch 125"]
[{"$f":"I19","v":0},"KLLZZULV100",null,"ZUL-Tellerventil 100"]
[{"$f":"O19","v":0},"KLLZZULV125",null,"ZUL-Tellerventil 125"]
[{"$f":"K19","v":0},"KLLZABLV100",null,"ABL-Tellerventil 100"]
[{"$f":"Q19","v":0},"KLLZABLV125",null,"ABL-Tellerventil 125"]
[{"$f":"(E7+E8)*1+(E9+E10+E13+E14)*2+(E11+E12+E15+E16)*3+(E17+E18)*4","v":0},"PKEA75/45",null,"Polokal-T-Stück 45° 75mm"]
[{"$f":"ROUNDUP(U19/5,-1)*5","v":0},"KLLZSCHL75",null,"Kunststoffschlauch 75mm"]
[{"$f":"ROUNDDOWN(A43/51,0)+A42","v":0},"KLLZVEM75",null,"Verbindungsmuffe 75mm"]

{"sheet":"Baugruppe seitlich","index":1,"n_rows":47,"n_cols":21,"rows_kept":47,"cut":false,"hidden":false,"merged":[[39,3,39,6],[40,3,40,6],[28,3,28,6],[20,1,20,2],[21,3,21,6],[22,3,22,6],[23,3,23,6],[24,3,24,6],[25,3,25,6],[26,3,26,6],[27,3,27,6],[20,3,20,6],[36,3,36,6],[33,3,33,6],[34,3,34,6],[37,3,37,6],[38,3,38,6],[29,3,29,6],[30,3,30,6],[31,3,31,6],[32,3,32,6],[35,3,35,6],[43,3,43,6],[44,3,44,6],[45,3,45,6],[46,3,46,6],[41,3,41,6],[42,3,42,6]]}
["PROJEKT: "]
[]
["Wandstärke:",25,"AWG:","ja","Laibung:",{"$f":"IF(D3=\"ja\",\"nein\",\"ja\")","v":"nein"},"VWS:",20]
[]
[]
["Wohnung","Typ","ZUL","Ablufträume","ANZ Whg","SN100","Summe","ZUL TV100","Summe","ABL TV100","Summe","SN125","Summe","ZUL TV125","Summe","ABL TV125","Summe","Abg.","m/Abg.","Gesamt/Whg","Summe"]
[null,"2-Zimmer","links","Bad, Küche",null,0,{"$f":"F7*E7","v":0},0,{"$f":"H7*E7","v":0},0,{"$f":"J7*E7","v":0},3,{"$f":"L7*E7","v":0},1,{"$f":"N7*E7","v":0},2,{"$f":"P7*E7","v":0},6,8,{"$f":"R7*S7","v":48},{"$f":"T7*E7","v":0}]
[null,"2-Zimmer","rechts","Bad, Küche",null,0,0,0,0,0,0,3,0,1,0,2,0,6,8,48,0]
[null,"2-Zimmer","links","WC, Bad, Küche",null,1,{"$f":"F9*E9","v":0},0,{"$f":"H9*E9","v":0},1,{"$f":"J9*E9","v":0},3,{"$f":"L9*E9","v":0},1,{"$f":"N9*E9","v":0},2,{"$f":"P9*E9","v":0},7,8,{"$f":"R9*S9","v":56},{"$f":"T9*E9","v":0}]
[null,"2-Zimmer","rechts","WC, Bad, Küche",null,1,0,0,0,1,0,3,0,1,0,2,0,7,8,56,0]
[null,"2-Zimmer","links","WC, Bad, Küche, AR",null,2,0,0,0,2,0,3,0,1,0,2,0,8,8,64,0]
[null,"2-Zimmer","rechts","WC, Bad, Küche, AR",null,2,0,0,0,2,0,3,0,1,0,2,0,8,8,64,0]
[null,"3-Zimmer","links","WC, Bad, Küche",null,2,0,1,0,1,0,3,0,1,0,2,0,8,8,64,0]
[null,"3-Zimmer","rechts","WC, Bad, Küche",null,2,0,1,0,1,0,3,0,1,0,2,0,8,8,64,0]
[null,"3-Zimmer","links","WC, Bad, Küche, AR",null,3,0,1,0,2,0,3,0,1,0,2,0,9,8,72,0]
[null,"3-Zimmer","rechts","WC, Bad, Küche, AR",null,3,0,1,0,2,0,3,0,1,0,2,0,9,8,72,0]
[null,"4-Zimmer","links","WC, Bad, Küche, AR",null,4,0,2,0,2,0,3,0,1,0,2,0,10,8,80,0]
[null,"4-Zimmer","rechts","WC, Bad, Küche, AR",null,4,0,2,0,2,0,3,0,1,0,2,0,10,8,80,0]
[null,null,null,null,{"$f":"SUM(E7:E18)","v":0},null,{"$f":"SUM(G7:G18)","v":0},null,{"$f":"SUM(I7:I18)","v":0},null,{"$f":"SUM(K7:K18)","v":0},null,{"$f":"SUM(M7:M18)","v":0},null,{"$f":"SUM(O7:O18)","v":0},null,{"$f":"SUM(Q7:Q18)","v":0},null,null,null,{"$f":"SUM(U7:U18)","v":0}]
[]
["Stück","Art.-Nr.",null,"Artikel"]
[{"$f":"E19*2","v":0},{"$f":"IF(B3=30,\"KLLAIRVT30\",\"KLLAIRVT25\")","v":"KLLAIRVT25"},null,{"$f":"IF(B22=\"KLLAIRVT30\",\"Verteilerelement 30cm\",\"Verteilerelement 25cm\")","v":"Verteilerelement 25cm"}]
[{"$f":"E8+E10+E12+E14+E16+E18","v":0},{"$f":"IF(B3=30,\"KLLAIRBGOR30\",\"KLLAIRBGOR25\")","v":"KLLAIRBGOR25"},null,{"$f":"IF(B23=\"KLLAIRBGOR30\",\"Baugruppe rechts 30cm\",\"Baugruppe rechts 25cm\")","v":"Baugruppe rechts 25cm"}]
[{"$f":"E7+E9+E11+E13+E15+E17","v":0},{"$f":"IF(B3=30,\"KLLAIRBGOL30\",\"KLLAIRBGOL25\")","v":"KLLAIRBGOL25"},null,{"$f":"IF(B24=\"KLLAIRBGOL30\",\"Baugruppe links 30cm\",\"Baugruppe links 25cm\")","v":"Baugruppe links 25cm"}]
[{"$f":"E19*2","v":0},"KLLKUNI100",null,"Doppelnippel DN100"]
[{"$f":"ROUNDUP(E19*5.1/25,0)","v":0},"KLLAIRSF20",null,"Bauteilfugenabdichtungsband innen"]
[{"$f":"ROUNDUP(E19*5.1/25,0)","v":0},"KLLAIRSF2",null,"Bauteilfugenabdichtungsband aussen"]
[{"$f":"E19","v":0},"KLLAIRZUU",null,"Zuluftumschaltung"]
[{"$f":"E19","v":0},"KLLAIRIBV",null,"Designinnenblende"]
[{"$f":"E19*2","v":0},"KLLRED125100",null,"Reduktion 125-100"]
[{"$f":"E19*0.4","v":0},"KLLZIRO125",null,"isoliertes Rohr 125mm"]
[{"$f":"E19","v":0},"KLLFLA125A",null,"Fassadenanschluss AUL"]
[{"$f":"E19","v":0},"KLLFLA125F",null,"Fassadenanschluss FOL"]
[{"$f":"E19","v":0},{"$f":"IF(H3=16,\"KLLAIRFLEB16\",IF(H3=18,\"KLLAIRFLEB18\",IF(H3=20,\"KLLAIRFLEB20\")))","v":"KLLAIRFLEB20"},null,{"$f":"IF(B34=\"KLLAIRFLEB16\",\"Fensterlaibungselement 16cm\",IF(B34=\"KLLAIRFLEB18\",\"Fensterlaibungselement 18cm\",IF(B34=\"KLLAIRFLEB20\",\"Fensterlaibungselement 20cm\")))","v":"Fensterlaibungselement 20cm"}]
[{"$f":"E19*2","v":0},"KLLAIRFAG",null,"Aussenwandgitter"]
[{"$f":"E19","v":0},"HOIBNKLAIRW1",null,"Inbetriebnahme"]
[{"$f":"G19","v":0},"KLLZSN10075",null,"Saugnische 100"]
[{"$f":"M19","v":0},"KLLZSN125752",null,"Saugnische 125"]
[{"$f":"G19","v":0},"KLLZSNFL100",null,"Flansch 100"]
[{"$f":"M19","v":0},"KLLZSNFL125",null,"Flansch 125"]
[{"$f":"I19","v":0},"KLLZZULV100",null,"ZUL-Tellerventil 100"]
[{"$f":"O19","v":0},"KLLZZULV125",null,"ZUL-Tellerventil 125"]
[{"$f":"K19","v":0},"KLLZABLV100",null,"ABL-Tellerventil 100"]
[{"$f":"Q19","v":0},"KLLZABLV125",null,"ABL-Tellerventil 125"]
[{"$f":"(E7+E8)*1+(E9+E10+E13+E14)*2+(E11+E12+E15+E16)*3+(E17+E18)*4","v":0},"PKEA75/45",null,"Polokal-T-Stück 45° 75mm"]
[{"$f":"ROUNDUP(U19/5,-1)*5","v":0},"KLLZSCHL75",null,"Kunststoffschlauch 75mm"]
[{"$f":"ROUNDDOWN(A46/51,0)+A45","v":0},"KLLZVEM75",null,"Verbindungsmuffe 75mm"]

{"sheet":"Baugruppe oben unten","index":2,"n_rows":40,"n_cols":21,"rows_kept":40,"cut":false,"hidden":false,"merged":[[39,3,39,6],[5,1,5,2],[7,1,7,2],[8,1,8,2],[9,1,9,2],[10,1,10,2],[30,3,30,6],[31,3,31,6],[32,3,32,6],[33,3,33,6],[34,3,34,6],[35,3,35,6],[24,3,24,6],[25,3,25,6],[14,1,14,2],[14,3,14,6],[15,3,15,6],[16,3,16,6],[17,3,17,6],[6,1,6,2],[37,3,37,6],[11,1,11,2],[38,3,38,6],[28,3,28,6],[29,3,29,6],[18,3,18,6],[19,3,19,6],[20,3,20,6],[21,3,21,6],[22,3,22,6],[23,3,23,6],[26,3,26,6],[27,3,27,6],[36,3,36,6]]}
["PROJEKT: "]
[]
["Wandstärke:",25,"AWG:","ja","Laibung:",{"$f":"IF(D3=\"ja\",\"nein\",\"ja\")","v":"nein"},"VWS:",20]
[]
[]
["Wohnung","Typ",null,"Ablufträume","ANZ Whg","SN100","Summe","ZUL V100","Summe","ABL TV100","Summe","SN125","Summe","ZUL V125","Summe","ABL TV125","Summe","Abg.","m/Abg.","Gesamt/Whg","Summe"]
[null,"2-Zimmer",null,"Bad, Küche",null,0,{"$f":"F7*E7","v":0},0,{"$f":"H7*E7","v":0},0,{"$f":"J7*E7","v":0},3,{"$f":"L7*E7","v":0},1,{"$f":"N7*E7","v":0},2,{"$f":"P7*E7","v":0},6,8,{"$f":"R7*S7","v":48},{"$f":"T7*E7","v":0}]
[null,"2-Zimmer",null,"WC, Bad, Küche",null,1,{"$f":"F8*E8","v":0},0,{"$f":"H8*E8","v":0},1,{"$f":"J8*E8","v":0},3,{"$f":"L8*E8","v":0},1,{"$f":"N8*E8","v":0},2,{"$f":"P8*E8","v":0},7,8,{"$f":"R8*S8","v":56},{"$f":"T8*E8","v":0}]
[null,"2-Zimmer",null,"WC, Bad, Küche, AR",null,2,0,0,0,2,0,3,0,1,0,2,0,8,8,64,0]
[null,"3-Zimmer",null,"WC, Bad, Küche",null,2,0,1,0,1,0,3,0,1,0,2,0,8,8,64,0]
[null,"3-Zimmer",null,"WC, Bad, Küche, AR",null,3,0,1,0,2,0,3,0,1,0,2,0,9,8,72,0]
[null,"4-Zimmer",null,"WC, Bad, Küche, AR",null,4,0,2,0,2,0,3,0,1,0,2,0,10,8,80,0]
[null,null,null,null,{"$f":"SUM(E7:E12)","v":0},null,{"$f":"SUM(G7:G12)","v":0},null,{"$f":"SUM(I7:I12)","v":0},null,{"$f":"SUM(K7:K12)","v":0},null,{"$f":"SUM(M7:M12)","v":0},null,{"$f":"SUM(O7:O12)","v":0},null,{"$f":"SUM(Q7:Q12)","v":0},null,null,null,{"$f":"SUM(U7:U12)","v":0}]
[]
["Stück","Art.-Nr.",null,"Artikel"]
[{"$f":"E13*2","v":0},{"$f":"IF(B3=30,\"KLLAIRVT30\",\"KLLAIRVT25\")","v":"KLLAIRVT25"},null,{"$f":"IF(B16=\"KLLAIRVT30\",\"Verteilerelement 30cm\",\"Verteilerelement 25cm\")","v":"Verteilerelement 25cm"}]
[{"$f":"E13","v":0},{"$f":"IF(B3=30,\"KLLAIRBGOU30\",\"KLLAIRBGOU25\")","v":"KLLAIRBGOU25"},null,{"$f":"IF(B17=\"KLLAIRBGOU30\",\"Baugruppe oben unten 30cm\",\"Baugruppe oben unten 25cm\")","v":"Baugruppe oben unten 25cm"}]
[{"$f":"E13*3","v":0},"KLLKUNI100",null,"Doppelnippel DN100"]
[{"$f":"ROUNDUP(E13*6.7/25,0)","v":0},"KLLAIRSF20",null,"Bauteilfugenabdichtungsband innen"]
[{"$f":"ROUNDUP(E13*6.7/25,0)","v":0},"KLLAIRSF2",null,"Bauteilfugenabdichtungsband aussen"]
[{"$f":"E13","v":0},"KLLAIRZUU",null,"Zuluftumschaltung"]
[{"$f":"E13","v":0},"KLLAIRIBV",null,"Designinnenblende"]
[{"$f":"E13*2","v":0},"KLLRED125100",null,"Reduktion 125-100"]
[{"$f":"E13*0.4","v":0},"KLLZIRO125",null,"isoliertes Rohr 125mm"]
[{"$f":"E13","v":0},"KLLFLA125A",null,"Fassadenanschluss AUL"]
[{"$f":"E13","v":0},"KLLFLA125F",null,"Fassadenanschluss FOL"]
[{"$f":"E13","v":0},{"$f":"IF(H3=16,\"KLLAIRFLEB16\",IF(H3=18,\"KLLAIRFLEB18\",IF(H3=20,\"KLLAIRFLEB20\")))","v":"KLLAIRFLEB20"},null,{"$f":"IF(B27=\"KLLAIRFLEB16\",\"Fensterlaibungselement 16cm\",IF(B27=\"KLLAIRFLEB18\",\"Fensterlaibungselement 18cm\",IF(B27=\"KLLAIRFLEB20\",\"Fensterlaibungselement 20cm\")))","v":"Fensterlaibungselement 20cm"}]
[{"$f":"E13*2","v":0},"KLLAIRFAG",null,"Aussenwandgitter"]
[{"$f":"E13","v":0},"HOIBNKLAIRW1",null,"Inbetriebnahme"]
[{"$f":"G13","v":0},"KLLZSN10075",null,"Saugnische 100"]
[{"$f":"M13","v":0},"KLLZSN125752",null,"Saugnische 125"]
[{"$f":"G13","v":0},"KLLZSNFL100",null,"Flansch 100"]
[{"$f":"M13","v":0},"KLLZSNFL125",null,"Flansch 125"]
[{"$f":"I13","v":0},"KLLZULVW100",null,"ZUL-Ventil 100 Rechteck"]
[{"$f":"O13","v":0},"KLLZULVW125",null,"ZUL-Ventil 125 Rechteck"]
[{"$f":"K13","v":0},"KLLZABLV100",null,"ABL-Tellerventil 100"]
[{"$f":"Q13","v":0},"KLLZABLV125",null,"ABL-Tellerventil 125"]
[{"$f":"E7*1+(E8+E10)*2+(E9+E11)*3+E12*4","v":0},"PKEA75/45",null,"Polokal-T-Stück 45° 75mm"]
[{"$f":"ROUNDUP(U13/5,-1)*5","v":0},"KLLZSCHL75",null,"Kunststoffschlauch 75mm"]
[{"$f":"ROUNDDOWN(A39/51,0)+A38","v":0},"KLLZVEM75",null,"Verbindungsmuffe 75mm"]

{"sheet":"Gerät mit Abluft-VT","index":3,"n_rows":36,"n_cols":21,"rows_kept":36,"cut":false,"hidden":false,"merged":[[11,1,11,2],[11,3,11,6],[12,3,12,6],[13,3,13,6],[14,3,14,6],[5,1,5,2],[6,1,6,2],[7,1,7,2],[8,1,8,2],[32,3,32,6],[20,3,20,6],[21,3,21,6],[22,3,22,6],[23,3,23,6],[24,3,24,6],[25,3,25,6],[16,3,16,6],[17,3,17,6],[18,3,18,6],[19,3,19,6],[15,3,15,6],[33,3,33,6],[34,3,34,6],[35,3,35,6],[26,3,26,6],[27,3,27,6],[28,3,28,6],[29,3,29,6],[30,3,30,6],[31,3,31,6]]}
["PROJEKT: "]
[]
["Wandstärke:",25,"AWG:","ja","Laibung:",{"$f":"IF(D3=\"ja\",\"nein\",\"ja\")","v":"nein"},"VWS:",20]
[]
[]
["Wohnung","Typ",null,"Ablufträume","ANZ Whg","SN100","Summe","ZUL V100","Summe","ABL TV100","Summe","SN125","Summe","ZUL V125","Summe","ABL TV125","Summe","Abg.","m/Abg.","Gesamt/Whg","Summe"]
[null,"1-Zimmer",null,"Bad",null,0,{"$f":"F7*E7","v":0},0,{"$f":"H7*E7","v":0},0,{"$f":"J7*E7","v":0},1,{"$f":"L7*E7","v":0},0,{"$f":"N7*E7","v":0},1,{"$f":"P7*E7","v":0},2,8,{"$f":"R7*S7","v":16},{"$f":"T7*E7","v":0}]
[null,"1-Zimmer",null,"WC, Bad",null,1,0,0,0,1,0,1,0,0,0,1,0,3,8,24,0]
[null,"1-Zimmer",null,"Bad, Küche",null,0,0,0,0,0,0,2,0,0,0,2,0,4,8,32,0]
[null,null,null,null,{"$f":"SUM(E7:E9)","v":0},null,{"$f":"SUM(G7:G9)","v":0},null,{"$f":"SUM(I7:I9)","v":0},null,{"$f":"SUM(K7:K9)","v":0},null,{"$f":"SUM(M7:M9)","v":0},null,{"$f":"SUM(O7:O9)","v":0},null,{"$f":"SUM(Q7:Q9)","v":0},null,null,null,{"$f":"SUM(U7:U9)","v":0}]
[]
["Stück","Art.-Nr.",null,"Artikel"]
[{"$f":"E10","v":0},{"$f":"IF(B3=30,\"KLLAIRVT30\",\"KLLAIRVT25\")","v":"KLLAIRVT25"},null,{"$f":"IF(B13=\"KLLAIRVT30\",\"Verteilerelement 30cm\",\"Verteilerelement 25cm\")","v":"Verteilerelement 25cm"}]
[{"$f":"E10","v":0},"KLLAIR100D",null,"Lüftungsgerät"]
[{"$f":"E10","v":0},"KLLKUNI100",null,"Doppelnippel DN100"]
[{"$f":"ROUNDUP(E10*4.3/25,0)","v":0},"KLLAIRSF20",null,"Bauteilfugenabdichtungsband innen"]
[{"$f":"ROUNDUP(E10*4.3/25,0)","v":0},"KLLAIRSF2",null,"Bauteilfugenabdichtungsband aussen"]
[{"$f":"E10","v":0},"KLLAIRIBV",null,"Designinnenblende"]
[{"$f":"E10*2","v":0},"KLLRED125100",null,"Reduktion 125-100"]
[{"$f":"E10*0.4","v":0},"KLLZIRO125",null,"isoliertes Rohr 125mm"]
[{"$f":"E10","v":0},"KLLFLA125A",null,"Fassadenanschluss AUL"]
[{"$f":"E10","v":0},"KLLFLA125F",null,"Fassadenanschluss FOL"]
[{"$f":"E10","v":0},{"$f":"IF(H3=16,\"KLLAIRFLEB16\",IF(H3=18,\"KLLAIRFLEB18\",IF(H3=20,\"KLLAIRFLEB20\")))","v":"KLLAIRFLEB20"},null,{"$f":"IF(B23=\"KLLAIRFLEB16\",\"Fensterlaibungselement 16cm\",IF(B23=\"KLLAIRFLEB18\",\"Fensterlaibungselement 18cm\",IF(B23=\"KLLAIRFLEB20\",\"Fensterlaibungselement 20cm\")))","v":"Fensterlaibungselement 20cm"}]
[{"$f":"E10*2","v":0},"KLLAIRFAG",null,"Aussenwandgitter"]
[{"$f":"E10","v":0},"HOIBNKLAIRW1",null,"Inbetriebnahme"]
[{"$f":"G10","v":0},"KLLZSN10075",null,"Saugnische 100"]
[{"$f":"M10","v":0},"KLLZSN125752",null,"Saugnische 125"]
[{"$f":"G10","v":0},"KLLZSNFL100",null,"Flansch 100"]
[{"$f":"M10","v":0},"KLLZSNFL125",null,"Flansch 125"]
[{"$f":"I10","v":0},"KLLZZULV100",null,"ZUL-Tellerventil 100"]
[{"$f":"O10","v":0},"KLLZZULV125",null,"ZUL-Tellerventil 125"]
[{"$f":"K10","v":0},"KLLZABLV100",null,"ABL-Tellerventil 100"]
[{"$f":"Q10","v":0},"KLLZABLV125",null,"ABL-Tellerventil 125"]
[{"$f":"E9","v":0},"PKEA75/45",null,"Polokal-T-Stück 45° 75mm"]
[{"$f":"ROUNDUP(U10/5,-1)*5","v":0},"KLLZSCHL75",null,"Kunststoffschlauch 75mm"]
[{"$f":"ROUNDDOWN(A35/51,0)+A34","v":0},"KLLZVEM75",null,"Verbindungsmuffe 75mm"]